{"text_format":"1","workbook":"xlsx","n_sheets":8,"sheets":["Notes","Repay Sensitivity","Calculator","HEM Table","Version Control","23 09 Revisions","Instructions","Sheet1"],"not_rendered":{"charts":0,"images":1,"macros":1,"external_links":0,"defined_names":2,"comments":2,"pivot_tables":0},"unopened":[],"bounds":{"document_bytes":16777216,"sheet_cells":100000,"rows_first":2000,"rows_last":500,"rows_between":2000,"halvings":0,"cell_chars":16384,"cell_head_chars":4096},"cells_cut":0,"cells_raw":0,"read":"whole","date_system":"1900"}

{"sheet":"Notes","index":0,"n_rows":21,"n_cols":10,"rows_kept":21,"cut":false,"hidden":true,"merged":[[17,6,20,11]]}
[]
[]
["Income","Step","Tier 1","Tier 2","Tier 3","Tier 4","Tier 5","Total","Mediban levi","Grand Total"]
[18201,null,0,null,null,null,null,{"$f":"C4+D4+E4+F4","v":0},{"$f":"A4*1.5%","v":273.01499999999999},{"$f":"H4+I4","v":273.01499999999999}]
[37001,{"$f":"A5-A4","v":18800},null,{"$f":"B5*19%","v":3572},null,null,null,{"$f":"C5+D5+E5+F5","v":3572},{"$f":"A5*1.5%","v":555.01499999999999},{"$f":"H5+I5","v":4127.0150000000003}]
[80001,{"$f":"A6-A5","v":43000},null,3572,{"$f":"B6*32.5%","v":13975},null,null,17547,1200.0149999999999,18747.014999999999]
[180000,{"$f":"A7-A6","v":99999},null,3572,13975,{"$f":"B7*37%","v":36999.629999999997},null,54546.63,2700,57246.63]
[180001,{"$f":"A8-A7","v":1},null,3572,13975,37000,{"$f":"B8*45%","v":0.45},{"$f":"D8+E8+F8+G8","v":54547.45},2700.0149999999999,57247.464999999997]
[]
[null,"Weekly","Annual","Child","WBA Calculations"]
["Couple",460.2,{"$f":"B11*52","v":23930.399999999998},null,23930,{"$f":"E11-C11","v":-0.39999999999781721}]
["Couple +1",572.04999999999995,{"$f":"B12*52","v":29746.6},{"$f":"C12-C11","v":5816.2000000000007},29746,{"$f":"E12-C12","v":-0.59999999999854481}]
["couple +2",683.9,35562.799999999996,{"$f":"C13-C12","v":5816.1999999999971},35562,-0.79999999999563443]
["Couple +3",795.75,41379,5816.2000000000044,41378,-1]
["Couple + 4",906.36,47130.720000000001,5751.7200000000012,47194,63.279999999998836]
{"$rows_left_out":7}
{"sheet":"Repay Sensitivity","index":1,"n_rows":35,"n_cols":7,"rows_kept":35,"cut":false,"hidden":true,"merged":[]}
[null,"Repayment Rate Sensitivity Analysis"]
[]
["This worksheet determines the sensitivity of commitments to rate increases."]
[]
[null,null,null,null,null,2.5000000000000001E-2]
[null,"Loan Amt","Rate","Term","Pmt","Stressed Pmt","% Increase"]
["P&I",20000,0.1,3,{"$f":"-PMT(C7/12,D7*12,B7,0)","v":645.34374387674961},{"$f":"-PMT((C7+$F$5)/12,D7*12,B7,0)","v":669.07251153433049},{"$f":"(F7-E7)/E7","v":3.6769191431276493E-2}]
[null,50000,0.1,3,{"$f":"-PMT(C8/12,D8*12,B8,0)","v":1613.3593596918743},{"$f":"-PMT((C8+$F$5)/12,D8*12,B8,0)","v":1672.6812788358261},{"$f":"(F8-E8)/E8","v":3.6769191431276278E-2}]
[]
[null,20000,0.1,5,{"$f":"-PMT(C10/12,D10*12,B10,0)","v":424.94089422536553},{"$f":"-PMT((C10+$F$5)/12,D10*12,B10,0)","v":449.95876450831679},{"$f":"(F10-E10)/E10","v":5.8873764852773028E-2}]
[null,50000,0.1,5,{"$f":"-PMT(C11/12,D11*12,B11,0)","v":1062.3522355634138},{"$f":"-PMT((C11+$F$5)/12,D11*12,B11,0)","v":1124.8969112707919},{"$f":"(F11-E11)/E11","v":5.8873764852772889E-2}]
[]
[null,20000,0.1,7,{"$f":"-PMT(C13/12,D13*12,B13,0)","v":332.02368053771812},{"$f":"-PMT((C13+$F$5)/12,D13*12,B13,0)","v":358.42476852630341},{"$f":"(F13-E13)/E13","v":7.9515677754756126E-2}]
[null,50000,0.1,7,{"$f":"-PMT(C14/12,D14*12,B14,0)","v":830.05920134429539},{"$f":"-PMT((C14+$F$5)/12,D14*12,B14,0)","v":896.06192131575847},{"$f":"(F14-E14)/E14","v":7.9515677754755945E-2}]
[]
{"$rows_left_out":21}
{"sheet":"Calculator","index":2,"n_rows":1112,"n_cols":57,"rows_kept":1112,"cut":false,"hidden":false,"merged":[[2,32,2,43],[61,0,61,7],[56,0,56,7],[57,0,57,7],[58,0,58,7],[59,0,59,7],[60,0,60,7],[7,2,7,3],[7,5,7,6],[13,5,13,6],[16,5,16,6],[11,2,11,3],[12,2,12,3],[13,2,13,3],[15,2,15,3],[16,2,16,3],[0,0,0,7],[8,2,8,4],[2,0,2,7],[14,0,14,7],[17,0,17,7],[4,0,4,7],[3,1,3,3],[10,0,10,7],[21,0,21,7],[5,2,5,3],[20,5,20,6],[18,2,18,3],[19,2,19,3],[20,2,20,3],[6,2,6,3]]}
["              Quick Qualifier"]
[null,null,null,null,null,"                                                                        Version 10.1 - September 2023",null,null,null,null,null,null,null,null,null,null,null,null,null,null,null,null,null,null,null,null,"\"HEM Table 1\" equivalent: by Income Level and Residency",null,null,null,null,null,null,null,null,null,null,null,null,null,null,null,null,null,"Metro Postcode","Code","Region",null,"Non Metro Postcodes","CODE","Region",null,"Region","S / C ?","Child ?","Single / Couple Code","Child Code"]
["BORROWER",null,null,null,null,null,null,null,null,null,null,null,null,null,null,null,null,null,null,null,null,null,null,null,null,null,"Total current gross HH income from all sources (measured in current dollars)",null,null,null,null,null,"Do not change any formulas from AA5:AQ78\nWhen inputting $ threshold column headers from Hem Table 1, move threshold amounts across one column to right to ensure that the LOWER value of the range is shown in row 4",null,null,null,null,null,null,null,null,null,null,null,1215,"SYD","Sydney",null,0,"AU","AU",null,{"$f":"IF($F$4=\"\",\"\",IF(ISERROR(VLOOKUP($F$4,$AS$3:$AU$1112,2,FALSE)),VLOOKUP($F$4,$AW$3:$AY$22,2,TRUE),VLOOKUP($F$4,$AS$3:$AU$1112,2,FALSE)))","v":""},{"$f":"IF($B$8=\"\",\"\",IF($B$8=1,\"S\",\"C\"))","v":""},{"$f":"IF($B$10=\"\",\"\",IF($B$10=1,\"Y\",IF(B10=2,\"Y2\",IF(B10>=3,\"Y3\",\"N\"))))","v":""},{"$f":"IF($BB$3=\"\",\"\",$BA$3&$BB$3&\"N\")","v":""},{"$f":"IF($BA$3&$BB$3&$BC$3=BD3,\"\",$BA$3&$BB$3&$BC$3)","v":""}]
["Applicant Name",null,null,null,"Postcode:",null,"Date:",{"$f":"TODAY()","v":"2023-08-21"},null,null,null,null,null,null,null,null,null,null,null,null,null,null,null,null,"Australia","CODE",0,25000,37000,49000,61000,74000,98000,123000,147000,172000,196000,246000,307000,368000,614000,null,null,null,1220,"SYD","Sydney",null,800,"NT","NT",null,"Additional Single",null,null,"Addition Single Code"]
[null,null,null,null,null,null,null,null,null,null,null,null,null,null,null,null,null,null,null,null,null,null,null,null,"AU Couple","AUCN",{"$f":"IFERROR('HEM Table'!C5*52,0)","v":29253.895429584416},{"$f":"IFERROR('HEM Table'!D5*52,0)","v":29253.895429584416},{"$f":"IFERROR('HEM Table'!E5*52,0)","v":29969.04519499006},{"$f":"IFERROR('HEM Table'!F5*52,0)","v":30992.524151180041},{"$f":"IFERROR('HEM Table'!G5*52,0)","v":32994.940522163248},{"$f":"IFERROR('HEM Table'!H5*52,0)","v":35884.053073343784},{"$f":"IFERROR('HEM Table'!I5*52,0)","v":40017.740134614935},{"$f":"IFERROR('HEM Table'!J5*52,0)","v":43858.284746009544},{"$f":"IFERROR('HEM Table'!K5*52,0)","v":48426.375875331134},{"$f":"IFERROR('HEM Table'!L5*52,0)","v":50704.512608917757},{"$f":"IFERROR('HEM Table'!M5*52,0)","v":53215.739928949057},{"$f":"IFERROR('HEM Table'!N5*52,0)","v":59758.644281267363},{"$f":"IFERROR('HEM Table'!O5*52,0)","v":66036.304150056065},{"$f":"IFERROR('HEM Table'!P5*52,0)","v":68194.541372423744},{"$f":"IFERROR('HEM Table'!P5*52,0)","v":68194.541372423744},null,null,null,1225,"SYD","Sydney",null,899,"NT","NT",null,{"$f":"IF($B$9=\"\",\"\",IF($B$9>0,\"SN\",\"\"))","v":""},null,null,{"$f":"IF(BA5=\"\",\"\",BA3&BA5)","v":""}]
["New Loan Amount",null,"Product Rate (New Loan)",null,null,null,null,null,null,null,null,null,null,null,null,null,null,null,null,null,null,null,null,null,"AU C child","AUCY",{"$f":"IFERROR('HEM Table'!C6*52,0)","v":34495.776895710049},{"$f":"IFERROR('HEM Table'!D6*52,0)","v":34495.776895710049},{"$f":"IFERROR('HEM Table'!E6*52,0)","v":34495.776895710049},{"$f":"IFERROR('HEM Table'!F6*52,0)","v":35518.286968849876},{"$f":"IFERROR('HEM Table'!G6*52,0)","v":37518.811987082932},{"$f":"IFERROR('HEM Table'!H6*52,0)","v":40405.192159975799},{"$f":"IFERROR('HEM Table'!I6*52,0)","v":44534.971842292442},{"$f":"IFERROR('HEM Table'!J6*52,0)","v":48371.886168431782},{"$f":"IFERROR('HEM Table'!K6*52,0)","v":52935.659297170256},{"$f":"IFERROR('HEM Table'!L6*52,0)","v":55211.641657951368},{"$f":"IFERROR('HEM Table'!M6*52,0)","v":57720.496191370657},{"$f":"IFERROR('HEM Table'!N6*52,0)","v":64257.215845527571},{"$f":"IFERROR('HEM Table'!O6*52,0)","v":70528.94173922544},{"$f":"IFERROR('HEM Table'!P6*52,0)","v":72685.138881979816},{"$f":"IFERROR('HEM Table'!P6*52,0)","v":72685.138881979816},null,null,null,1230,"SYD","Sydney",null,1100,"NSW","NSW",null,"Cost for Single or additional single",null,null,"Salary Match: Cost for Couple"]
["New Loan Term (months)",null,"Stressed Product Rate (New Loan)",null,{"$f":"MAX(0.07,E6+0.03)","v":7.0000000000000007E-2},null,null,null,null,null,null,null,null,null,null,null,null,null,null,null,null,null,null,null,"AU C child2","AUCY2",{"$f":"IFERROR('HEM Table'!C7*52,0)","v":38263.978655224215},{"$f":"IFERROR('HEM Table'!D7*52,0)","v":38263.978655224215},{"$f":"IFERROR('HEM Table'!E7*52,0)","v":38263.978655224215},{"$f":"IFERROR('HEM Table'!F7*52,0)","v":39287.652530689418},{"$f":"IFERROR('HEM Table'!G7*52,0)","v":41290.449777915535},{"$f":"IFERROR('HEM Table'!H7*52,0)","v":44180.110636228579},{"$f":"IFERROR('HEM Table'!I7*52,0)","v":48314.587825768038},{"$f":"IFERROR('HEM Table'!J7*52,0)","v":52155.86290134189},{"$f":"IFERROR('HEM Table'!K7*52,0)","v":56724.824972330767},{"$f":"IFERROR('HEM Table'!L7*52,0)","v":59003.390777249195},{"$f":"IFERROR('HEM Table'!M7*52,0)","v":61515.101149607406},{"$f":"IFERROR('HEM Table'!N7*52,0)","v":68059.251583407444},{"$f":"IFERROR('HEM Table'!O7*52,0)","v":74338.107018459952},{"$f":"IFERROR('HEM Table'!P7*52,0)","v":76496.755272273484},{"$f":"IFERROR('HEM Table'!P7*52,0)","v":76496.755272273484},null,null,null,1235,"SYD","Sydney",null,2999,"NSW","NSW",null,{"$f":"IF($BB$3=\"C\",$BA$9,HLOOKUP($J$38,$Z$4:$AQ$139,MATCH(BD3,$Z$4:$Z$139,0),TRUE))","v":0},null,null,{"$f":"IF($BB$3=\"S\",\"\",HLOOKUP($J$38,$Z$4:$AQ$139,MATCH(BD3,$Z$4:$Z$139,0),TRUE))","v":0}]
["No. of Adults",null,"Repay (New Loan)",null,{"$f":"IF(B6>0,INT(-PMT(E6/12,B7,B6,0)),0)","v":0},"Stress (New Loan):",null,{"$f":"MAX(IF(B6>0,INT(-PMT(E7/12,B7,B6,0)),0),D28)","v":0},null,null,null,null,null,null,null,null,null,null,null,null,null,null,null,null,"AU C child3","AUCY3",{"$f":"IFERROR('HEM Table'!C8*52,0)","v":42538.094956107132},{"$f":"IFERROR('HEM Table'!D8*52,0)","v":42538.094956107132},{"$f":"IFERROR('HEM Table'!E8*52,0)","v":42538.094956107132},{"$f":"IFERROR('HEM Table'!F8*52,0)","v":42538.094956107132},{"$f":"IFERROR('HEM Table'!G8*52,0)","v":44544.234167280112},{"$f":"IFERROR('HEM Table'!H8*52,0)","v":47438.716852875245},{"$f":"IFERROR('HEM Table'!I8*52,0)","v":51580.093030180811},{"$f":"IFERROR('HEM Table'!J8*52,0)","v":55427.777842351992},{"$f":"IFERROR('HEM Table'!K8*52,0)","v":60004.362942964508},{"$f":"IFERROR('HEM Table'!L8*52,0)","v":62286.734714693448},{"$f":"IFERROR('HEM Table'!M8*52,0)","v":64802.633366324881},{"$f":"IFERROR('HEM Table'!N8*52,0)","v":71357.703684722772},{"$f":"IFERROR('HEM Table'!O8*52,0)","v":77647.036320360945},{"$f":"IFERROR('HEM Table'!P8*52,0)","v":79809.286598617153},{"$f":"IFERROR('HEM Table'!P8*52,0)","v":79809.286598617153},null,null,null,1240,"SYD","Sydney",null,3000,"VIC","VIC",null,"Salary Match: Cost for each additional single"]
["Number of Additional Single Applicants",null,null,null,null,null,null,null,null,null,null,null,null,null,null,null,null,null,null,null,null,null,null,null,"AU Single","AUSN",{"$f":"IFERROR('HEM Table'!C9*52,0)","v":14900.750079631729},{"$f":"IFERROR('HEM Table'!D9*52,0)","v":15787.039878539195},{"$f":"IFERROR('HEM Table'!E9*52,0)","v":16503.242646110342},{"$f":"IFERROR('HEM Table'!F9*52,0)","v":17528.227461020346},{"$f":"IFERROR('HEM Table'!G9*52,0)","v":19533.589305178335},{"$f":"IFERROR('HEM Table'!H9*52,0)","v":22426.951009777829},{"$f":"IFERROR('HEM Table'!I9*52,0)","v":26566.72145282467},{"$f":"IFERROR('HEM Table'!J9*52,0)","v":30412.913409366716},{"$f":"IFERROR('HEM Table'!K9*52,0)","v":34987.725523030182},{"$f":"IFERROR('HEM Table'!L9*52,0)","v":37269.212616174875},{"$f":"IFERROR('HEM Table'!M9*52,0)","v":39784.135110833056},{"$f":"IFERROR('HEM Table'!N9*52,0)","v":46336.666514460798},{"$f":"IFERROR('HEM Table'!O9*52,0)","v":52623.559398219993},{"$f":"IFERROR('HEM Table'!P9*52,0)","v":54784.971558629397},{"$f":"IFERROR('HEM Table'!P9*52,0)","v":54784.971558629397},null,null,null,1350,"SYD","Sydney",null,3999,"VIC","VIC",null,{"$f":"HLOOKUP($J$38,$Z$4:$AQ$139,MATCH(BD5,$Z$4:$Z$139,0),TRUE)","v":0}]
["No. of Children",null,null,null,null,null,null,null,null,null,null,null,null,null,null,null,null,null,null,null,null,null,null,null,"AU S child","AUSY",{"$f":"IFERROR('HEM Table'!C10*52,0)","v":21051.858026312566},{"$f":"IFERROR('HEM Table'!D10*52,0)","v":21051.858026312566},{"$f":"IFERROR('HEM Table'!E10*52,0)","v":21766.891704998256},{"$f":"IFERROR('HEM Table'!F10*52,0)","v":22790.204524917608},{"$f":"IFERROR('HEM Table'!G10*52,0)","v":24792.295853567408},{"$f":"IFERROR('HEM Table'!H10*52,0)","v":27680.939429414568},{"$f":"IFERROR('HEM Table'!I10*52,0)","v":31813.955489735334},{"$f":"IFERROR('HEM Table'!J10*52,0)","v":35653.876684541792},{"$f":"IFERROR('HEM Table'!K10*52,0)","v":40221.226298251837},{"$f":"IFERROR('HEM Table'!L10*52,0)","v":42498.991315977444},{"$f":"IFERROR('HEM Table'!M10*52,0)","v":45009.813876723441},{"$f":"IFERROR('HEM Table'!N10*52,0)","v":51551.659027588881},{"$f":"IFERROR('HEM Table'!O10*52,0)","v":57828.29795773192},{"$f":"IFERROR('HEM Table'!P10*52,0)","v":59986.184844139025},{"$f":"IFERROR('HEM Table'!P10*52,0)","v":59986.184844139025},null,null,null,1355,"SYD","Sydney",null,4000,"QLD","QLD",null,"Salary Match: Cost for each child"]
["EXISTING AUSWIDE COMMITMENTS",null,null,null,null,null,null,null,null,null,null,null,null,null,null,null,null,null,null,null,null,null,null,null,"AU S child2","AUSY2",{"$f":"IFERROR('HEM Table'!C11*52,0)","v":26959.938508343363},{"$f":"IFERROR('HEM Table'!D11*52,0)","v":26959.938508343363},{"$f":"IFERROR('HEM Table'!E11*52,0)","v":27673.027386787031},{"$f":"IFERROR('HEM Table'!F11*52,0)","v":28693.554668267956},{"$f":"IFERROR('HEM Table'!G11*52,0)","v":30690.194732770731},{"$f":"IFERROR('HEM Table'!H11*52,0)","v":33570.973843010797},{"$f":"IFERROR('HEM Table'!I11*52,0)","v":37692.738532131778},{"$f":"IFERROR('HEM Table'!J11*52,0)","v":41522.204408065641},{"$f":"IFERROR('HEM Table'!K11*52,0)","v":46077.120157408106},{"$f":"IFERROR('HEM Table'!L11*52,0)","v":48348.680986646912},{"$f":"IFERROR('HEM Table'!M11*52,0)","v":50852.669628943753},{"$f":"IFERROR('HEM Table'!N11*52,0)","v":57376.702392128471},{"$f":"IFERROR('HEM Table'!O11*52,0)","v":63636.254794754423},{"$f":"IFERROR('HEM Table'!P11*52,0)","v":65788.264822419733},{"$f":"IFERROR('HEM Table'!P11*52,0)","v":65788.264822419733},null,null,null,1360,"SYD","Sydney",null,4999,"QLD","QLD",null,{"$f":"IF(OR(ISERROR(HLOOKUP($J$38,$Z$4:$AQ$139,MATCH(BE3,$Z$4:$Z$139,0),TRUE)),$H$38=\"\"),\"\",HLOOKUP($J$38,$Z$4:$AQ$139,MATCH(BE3,$Z$4:$Z$139,0),TRUE))","v":0}]
["Existing Home Loan (Auswide) total exposure ",null,"Existing HL Product Rate",null,null,null,null,null,null,null,null,null,null,null,null,null,null,null,null,null,null,null,null,null,"AU S child3","AUSY3",{"$f":"IFERROR('HEM Table'!C12*52,0)","v":33579.163068575806},{"$f":"IFERROR('HEM Table'!D12*52,0)","v":33579.163068575806},{"$f":"IFERROR('HEM Table'!E12*52,0)","v":33579.163068575806},{"$f":"IFERROR('HEM Table'!F12*52,0)","v":34596.904811618311},{"$f":"IFERROR('HEM Table'!G12*52,0)","v":36588.093611974051},{"$f":"IFERROR('HEM Table'!H12*52,0)","v":39461.008256607027},{"$f":"IFERROR('HEM Table'!I12*52,0)","v":43571.521574528226},{"$f":"IFERROR('HEM Table'!J12*52,0)","v":47390.532131589483},{"$f":"IFERROR('HEM Table'!K12*52,0)","v":51933.014016564368},{"$f":"IFERROR('HEM Table'!L12*52,0)","v":54198.370657316365},{"$f":"IFERROR('HEM Table'!M12*52,0)","v":56695.525381164065},{"$f":"IFERROR('HEM Table'!N12*52,0)","v":63201.745756668053},{"$f":"IFERROR('HEM Table'!O12*52,0)","v":69444.211631776925},{"$f":"IFERROR('HEM Table'!P12*52,0)","v":71590.344800700434},{"$f":"IFERROR('HEM Table'!P12*52,0)","v":71590.344800700434},null,null,null,1435,"SYD","Sydney",null,5000,"SA","SA"]
["Remaining Term (months)",null,"Stressed HL Product Rate",null,{"$f":"MAX(0.07,E12+0.03)","v":7.0000000000000007E-2},null,null,null,null,null,null,null,null,null,null,null,null,null,null,null,null,null,null,null,"Sydney",null,null,null,null,null,null,null,null,null,null,null,null,null,null,null,null,null,null,null,1445,"SYD","Sydney",null,5854,"SA","SA"]
[null,null,"Repay (existing HL)",null,{"$f":"IF(B12>0,INT(-PMT(E12/12,B13,B12,0)),0)","v":0},"Stressed repayment",null,{"$f":"IF(B12>0,INT(-PMT(E13/12,B13,B12,0)),0)","v":0},null,null,null,null,null,null,null,null,null,null,null,null,null,null,null,null,"SYD Couple","SYDCN",{"$f":"IFERROR('HEM Table'!C14*52,0)","v":28403.953271653572},{"$f":"IFERROR('HEM Table'!D14*52,0)","v":28403.953271653572},{"$f":"IFERROR('HEM Table'!E14*52,0)","v":29119.103037059209},{"$f":"IFERROR('HEM Table'!F14*52,0)","v":30142.581993249198},{"$f":"IFERROR('HEM Table'!G14*52,0)","v":32144.998364232408},{"$f":"IFERROR('HEM Table'!H14*52,0)","v":35034.110436033487},{"$f":"IFERROR('HEM Table'!I14*52,0)","v":39167.79845606353},{"$f":"IFERROR('HEM Table'!J14*52,0)","v":43008.342108699253},{"$f":"IFERROR('HEM Table'!K14*52,0)","v":47576.434196779737},{"$f":"IFERROR('HEM Table'!L14*52,0)","v":49854.569971607467},{"$f":"IFERROR('HEM Table'!M14*52,0)","v":52365.798250397667},{"$f":"IFERROR('HEM Table'!N14*52,0)","v":58908.702602715966},{"$f":"IFERROR('HEM Table'!O14*52,0)","v":65186.362471504661},{"$f":"IFERROR('HEM Table'!P14*52,0)","v":67344.599693872355},{"$f":"IFERROR('HEM Table'!P14*52,0)","v":67344.599693872355},null,null,null,1450,"SYD","Sydney",null,6000,"WA","WA"]
[null,null,null,null,null,null,null,null,null,null,null,null,null,null,null,null,null,null,null,null,null,null,null,null,"SYD C child","SYDCY",{"$f":"IFERROR('HEM Table'!C15*52,0)","v":33599.279040520123},{"$f":"IFERROR('HEM Table'!D15*52,0)","v":33599.279040520123},{"$f":"IFERROR('HEM Table'!E15*52,0)","v":33599.279040520123},{"$f":"IFERROR('HEM Table'!F15*52,0)","v":34621.78911365995},{"$f":"IFERROR('HEM Table'!G15*52,0)","v":36622.314131892999},{"$f":"IFERROR('HEM Table'!H15*52,0)","v":39508.693825859555},{"$f":"IFERROR('HEM Table'!I15*52,0)","v":43638.476381734072},{"$f":"IFERROR('HEM Table'!J15*52,0)","v":47475.389750020797},{"$f":"IFERROR('HEM Table'!K15*52,0)","v":52039.163836611893},{"$f":"IFERROR('HEM Table'!L15*52,0)","v":54315.142365982494},{"$f":"IFERROR('HEM Table'!M15*52,0)","v":56824.00168866491},{"$f":"IFERROR('HEM Table'!N15*52,0)","v":63360.721342821824},{"$f":"IFERROR('HEM Table'!O15*52,0)","v":69632.447236519671},{"$f":"IFERROR('HEM Table'!P15*52,0)","v":71788.642463568816},{"$f":"IFERROR('HEM Table'!P15*52,0)","v":71788.642463568816},null,null,null,1455,"SYD","Sydney",null,6999,"WA","WA"]
{"$rows_left_out":1098}
{"sheet":"HEM Table","index":3,"n_rows":138,"n_cols":17,"rows_kept":138,"cut":false,"hidden":true,"merged":[]}
[]
[null,null,"\"HEM Table 1\" equivalent: by Income Level and Residency"]
[null,"Australia","Total current gross HH income from all sources (measured in current dollars)"]
[null,"Range up to:",25000,37000,50000,62000,74000,99000,124000,149000,173000,198000,248000,309000,371000,619000,"NB Upper range shown here"]
[null,"Couple",562.57491210739261,562.57491210739261,576.32779221134729,596.01007983038539,634.51808696467788,690.07794371814964,769.57192566567176,843.4285528078758,931.27645914098332,975.08678094072616,1023.3796140182511,1149.2046977166801,1269.9289259626166,1311.433487931226]
[null,"Couple with 1 child",663.38032491750096,663.38032491750096,663.38032491750096,683.04398017018991,721.51561513621027,777.02292615338069,856.44176619793154,930.22858016214968,1017.9934480225049,1061.7623395759879,1110.0095421417434,1235.7156893370686,1356.3258026774122,1397.7911323457656]
[null,"Couple with 2 children",735.84574336969638,735.84574336969638,735.84574336969638,755.531779436335,794.04711111376037,849.61751223516501,929.1266889570777,1002.997363487344,1090.8620186986686,1134.6805918701768,1182.982714415527,1308.8317612193739,1429.5789811242298,1471.091447543721]
[null,"Couple with 3 children",818.04028761744485,818.04028761744485,818.04028761744485,818.04028761744485,856.61988783230981,912.28301640144707,991.92486596501556,1065.9188046606153,1153.9300565954713,1197.8218214364124,1246.20448781394,1372.2635323985148,1493.2122369300182,1534.7939730503299]
[null,"Single person",286.55288614676402,303.59692074113838,317.37005088673737,337.08129732731436,375.64594817650641,431.28751941880444,510.8984894773975,584.8637194108984,672.84087544288809,716.71562723413217,765.07952136217421,891.08974066270764,1011.991526888846,1053.5571453582577]
[null,"Single parent with 1 child",404.84342358293395,404.84342358293395,418.59407124996642,438.27316394072324,476.7749202609117,532.32575825797244,611.80683634106413,685.65147470272677,773.48512112022763,817.2882945380278,865.57334378314306,991.37805822286316,1112.0826530333061,1153.5804777719043]
[null,"Single parent with 2 children",518.46035592968008,518.46035592968008,532.17360359205827,551.79912823592224,590.19605255328327,645.59565082713073,724.86035638714964,798.50393092433922,886.09846456554044,929.78232666628674,977.93595440276454,1103.3981229255476,1223.7741306683542,1265.158938892687]
[null,"Single parent with 3 children",645.75313593415012,645.75313593415012,645.75313593415012,665.3250925311213,703.61718484565483,758.86554339628901,837.91387643323515,911.35638714595166,998.71180801085325,1042.2763587945456,1090.2985650223859,1215.4181876282319,1335.4656083034024,1376.7374000134698]
[null,"Sydney"]
[null,"Couple",546.22987060872254,546.22987060872254,559.9827507126771,579.66503833171532,618.17304546600781,673.73289300064391,753.22689338583712,827.08350209037019,914.93142686114879,958.74173022322054,1007.0345817384167,1132.8596654368455,1253.583893682782,1295.0884556513915]
[null,"Couple with 1 child",646.13998154846388,646.13998154846388,646.13998154846388,665.80363680115283,704.27527176717308,759.78257357422217,839.20146887950136,912.98826442347683,1000.7531507040749,1044.5219685765865,1092.769263243556,1218.4754104388812,1339.0855237792246,1380.5508166070927]
{"$rows_left_out":124}
{"sheet":"Version Control","index":4,"n_rows":33,"n_cols":4,"rows_kept":33,"cut":false,"hidden":true,"merged":[]}
["Version","Date","Comment","Approved"]
[1,"2016-06-08","Development of quick qualifier","C. Lonergan"]
[2,"2016-11-01","Amended to include advanced HEM by income band and geographical location","C. Lonergan"]
[3,"2017-08-18","HEM updated to Q2 2017 together with requirement for $200 monthly surplus to allow for savings or unexpected expenses","C. Lonergan"]
[3.1,"2018-02-05","DSR corrected to include overtime for 2nd applicant","C. Lonergan"]
[3.2,"2018-10-02","New tax tables inserted, DSR changed to DTI and min credit card payment changed from 3.0% to 3.8%.","C. Lonergan"]
[4,"2018-12-01","HEM Updated to Q3 2018 ","C. Lonergan"]
[4.0999999999999996,"2019-05-09","HEM Updated to Q4 2018","C. Lonergan"]
[5,"2019-06-01","Floor rate changed to 7%, $200 savings buffer removed and HEM updated t0 Q1 2019","C. Lonergan"]
[6]
[6.1,"2019-08-19","Updated HEM Q2 2019","C. Lonergan"]
[6.1,"2019-09-30","Updated Instructions"]
[6.2,"2019-10-22","Updated Floor rate","C. Lonergan"]
[6.3,"2020-02-28","Updated HEM 2019Q4","C. Lonergan"]
[6.4,"2020-05-18","Updated HEM Q1 2020","C. Lonergan"]
{"$rows_left_out":19}
{"sheet":"23 09 Revisions","index":5,"n_rows":2,"n_cols":3,"rows_kept":2,"cut":false,"hidden":true,"merged":[]}
["Revisions (detail)",null,"Cells revised"]
[1,"HEM 2023Q2"]

{"sheet":"Instructions","index":6,"n_rows":56,"n_cols":3,"rows_kept":56,"cut":false,"hidden":true,"merged":[]}
["Instructions"]
[1,"Copy HEM tables workbook to new workbook.  Use this copied file to work on, retaining original for reference."]
[2,"In the copied HEM workbook, and where there is no data included in the low income columns, copy first available amount and past to lower income columns"]
[3,"Check and review blank cells in cols AB/AC/AD to ensure all completed as above"]
[4,"Copy Drop in Tables \"HEM Table 1\" equivalent: by income Level and Residency to new tab HEM workbook"]
[5,"Re-name tab \"Updated Version\""]
[6,"Delete extra rows including any at top of table name, so there is no gaps in the data table"]
[7,"Copy ACT & NT and add to data (Row 135)"]
[8,"Delete NT from first, ACT from second"]
[9,"Highlight data from cells B10:O143","Not required"]
[10,"Remove currency formatting (click on comma in ribbon and extend number of decimal places shown to 4 places, if required)","Not required"]
[11,"Highlight rows from row 9 (Australia) and change font to Arial 10"]
[12,"Copy data from row 10 Couple to new Quick Qualifier HEM Table cell B5 (check cells before each update to ensure correct data range transferred"]
[13,"Enter the upper income range in cell B8 (e.g. $22,000) and copy Income upper range in row 4 Range up to: to new QQ (row 8)"]
[14,"Ensure changed in the Calculator tab as well as HEM Table tab"]
{"$rows_left_out":42}
{"sheet":"Sheet1","index":7,"n_rows":0,"n_cols":0,"rows_kept":0,"cut":false,"hidden":true,"merged":[]}